Code breakpoints

After you have edited the source code, post your patch here.
Forum rules
Home | Wiki | Rules

Code breakpoints

Postby queuesclimber » 20 Jun 2014 17:15

Last good rev = 9397
Broken points 9444
User avatar
queuesclimber
 
Posts: 250
Joined: 29 Oct 2013 16:24

Re: Code breakpoints

Postby raspopov » 20 Jun 2014 17:49

Your bug reports are so confusing...
User avatar
raspopov
Project Admin
 
Posts: 944
Joined: 13 Jun 2009 12:30
Location: Russian Federation

Re: Code breakpoints

Postby queuesclimber » 20 Jun 2014 18:36

Edit: Silly reply removed
Broken .exe from 9443 to 9444 (tr)
User avatar
queuesclimber
 
Posts: 250
Joined: 29 Oct 2013 16:24

Re: Code breakpoints

Postby queuesclimber » 06 Jul 2014 16:08

Fixed with VC10/Intel11.
User avatar
queuesclimber
 
Posts: 250
Joined: 29 Oct 2013 16:24

Re: Code breakpoints

Postby queuesclimber » 19 Jul 2014 22:31

r9464
Code: Select all
2>e:\trunk\torrentwizard\..\Shareaza\BENode.h(40): error C2146: syntax error : missing ';' before identifier 'm_nPosition'
2>e:\trunk\torrentwizard\..\Shareaza\BENode.h(40): error C4430: missing type specifier - int assumed. Note: C++ does not support default-int
2>e:\trunk\torrentwizard\..\Shareaza\BENode.h(40): error C4430: missing type specifier - int assumed. Note: C++ does not support default-int
2>e:\trunk\torrentwizard\..\Shareaza\BENode.h(41): error C2146: syntax error : missing ';' before identifier 'm_nSize'
2>e:\trunk\torrentwizard\..\Shareaza\BENode.h(41): error C4430: missing type specifier - int assumed. Note: C++ does not support default-int
2>e:\trunk\torrentwizard\..\Shareaza\BENode.h(41): error C4430: missing type specifier - int assumed. Note: C++ does not support default-int
1>  CtrlCoolMenuBar.cpp

This is from vs, not tr.
User avatar
queuesclimber
 
Posts: 250
Joined: 29 Oct 2013 16:24

Re: Code breakpoints

Postby raspopov » 20 Jul 2014 12:41

Code: Select all
------ Rebuild All started: Project: TorrentWizard, Configuration: Debug Win32 ------
  StdAfx.cpp
  BENode.cpp
  Buffer.cpp
  Strings.cpp
  CmdLine.cpp
  PageComment.cpp
  PageFinished.cpp
  PageOutput.cpp
  PagePackage.cpp
  PageSingle.cpp
  PageTracker.cpp
  PageWelcome.cpp
  TorrentBuilder.cpp
  TorrentWizard.cpp
  WizardSheet.cpp
  Generating Code...
  TorrentWizard_12.vcxproj -> C:\Projects\Shareaza\2.7.6.0\vc12\Win32\Debug\TorrentWizard.exe
========== Rebuild All: 1 succeeded, 0 failed, 0 skipped ==========
User avatar
raspopov
Project Admin
 
Posts: 944
Joined: 13 Jun 2009 12:30
Location: Russian Federation

Re: Code breakpoints

Postby queuesclimber » 21 Jul 2014 16:26

raspopov wrote:
Code: Select all
------ Rebuild All started: Project: TorrentWizard, Configuration: Debug Win32 ------

Try with x64 Release. :roll:
User avatar
queuesclimber
 
Posts: 250
Joined: 29 Oct 2013 16:24

Re: Code breakpoints

Postby raspopov » 21 Jul 2014 17:01

Code: Select all
------ Rebuild All started: Project: TorrentWizard, Configuration: Release x64 ------
  StdAfx.cpp
  BENode.cpp
  Buffer.cpp
  Strings.cpp
  CmdLine.cpp
  PageComment.cpp
  PageFinished.cpp
  PageOutput.cpp
  PagePackage.cpp
  PageSingle.cpp
  PageTracker.cpp
  PageWelcome.cpp
  TorrentBuilder.cpp
  TorrentWizard.cpp
  WizardSheet.cpp
  Generating code
  Finished generating code
  TorrentWizard_12.vcxproj -> C:\Projects\Shareaza\2.7.6.0\vc12\x64\Release\TorrentWizard.exe
========== Rebuild All: 1 succeeded, 0 failed, 0 skipped ==========


UPD: Oh... you using VS2010...
User avatar
raspopov
Project Admin
 
Posts: 944
Joined: 13 Jun 2009 12:30
Location: Russian Federation

Re: Code breakpoints

Postby queuesclimber » 21 Jul 2014 21:43

Thx for updating.
User avatar
queuesclimber
 
Posts: 250
Joined: 29 Oct 2013 16:24


Return to Code Submission

Who is online

Users browsing this forum: No registered users and 1 guest